BDBM50081907 5-(3-Ethoxy-benzyl)-pyrimidine-2,4-diamine::CHEMBL137448
SMILES CCOc1cccc(Cc2cnc(N)nc2N)c1
InChI Key InChIKey=KTYSFHHOATVLLG-UHFFFAOYSA-N
Data  4 KI
  Tab Delimited (TSV)   2D SDfile   Computed 3D by Vconf -m prep SDfile
Find this compound or compounds like it in BindingDB:
Activity Spreadsheet -- Enzyme Inhibition Constant Data from BindingDB
Found 4 hits for monomerid = 50081907
TargetDihydrofolate reductase(Homo sapiens (Human))
Cardiff University
Curated by ChEMBL
LigandPNGBDBM50081907(5-(3-Ethoxy-benzyl)-pyrimidine-2,4-diamine | CHEMB...)
Affinity DataKi:  8.60nM. Assay description: Inhibition of recombinant Dihydrofolate reductase from humans.
In DepthDetails ArticlePubMed
TargetDihydrofolate reductase(Homo sapiens (Human))
Cardiff University
Curated by ChEMBL
LigandPNGBDBM50081907(5-(3-Ethoxy-benzyl)-pyrimidine-2,4-diamine | CHEMB...)
Affinity DataKi:  156nM. Assay description: Inhibition of recombinant Dihydrofolate reductase from Leishmania major.
In DepthDetails ArticlePubMed
TargetDihydrofolate reductase(Homo sapiens (Human))
Cardiff University
Curated by ChEMBL
LigandPNGBDBM50081907(5-(3-Ethoxy-benzyl)-pyrimidine-2,4-diamine | CHEMB...)
Affinity DataKi:  430nM. Assay description: Inhibition of recombinant Dihydrofolate reductase from Trypanosoma cruzi.
In DepthDetails ArticlePubMed
TargetDihydrofolate reductase(Homo sapiens (Human))
Cardiff University
Curated by ChEMBL
LigandPNGBDBM50081907(5-(3-Ethoxy-benzyl)-pyrimidine-2,4-diamine | CHEMB...)
Affinity DataKi:  1.60E+3nM. Assay description: Inhibition of recombinant Dihydrofolate reductase from humans.
In DepthDetails ArticlePubMed