BDBM50081993 7-Methyl-4-(4-methyl-piperazin-1-yl)-pyrrolo[1,2-a]quinoxaline::CHEMBL422279
SMILES CN1CCN(CC1)c1nc2cc(C)ccc2n2cccc12
InChI Key InChIKey=FBYTVJACOAVEGV-UHFFFAOYSA-N
Data  1 IC50  1 EC50
  Tab Delimited (TSV)   2D SDfile   Computed 3D by Vconf -m prep SDfile
Find this compound or compounds like it in BindingDB:
Activity Spreadsheet -- Enzyme Inhibition Constant Data from BindingDB
Found 2 hits for monomerid = 50081993
Target5-hydroxytryptamine receptor 3A/3B(Rattus norvegicus)
Universita' Degli Studi Di Salerno
Curated by ChEMBL
LigandPNGBDBM50081993(7-Methyl-4-(4-methyl-piperazin-1-yl)-pyrrolo[1,2-a...)
Affinity DataIC50:  18nM. Assay description: Binding affinity against 5-hydroxytryptamine 3 (5-HT3) receptor from rat cortical homogenate using [3H]-zacopride as radioligand
In DepthDetails ArticlePubMed
Target5-hydroxytryptamine receptor 3A/3B(Homo sapiens (Human))
Universita' Degli Studi Di Salerno
Curated by ChEMBL
LigandPNGBDBM50081993(7-Methyl-4-(4-methyl-piperazin-1-yl)-pyrrolo[1,2-a...)
Affinity DataEC50:  14nM. Assay description: Effective concentration against 5-Hydroxytryptamine 3 receptor by measuring [14C]-guanidinium uptake on NG108-15 cells.
In DepthDetails ArticlePubMed