BDBM50082156 2-[4-(3-Hydroxyamino-benzoyl)-benzyl]-5-methyl-3H-thieno[2,3-d]pyrimidin-4-one::CHEMBL317816
SMILES Cc1csc2nc(Cc3ccc(cc3)C(=O)c3cccc(NO)c3)[nH]c(=O)c12
InChI Key InChIKey=MBPQFGXEBOXXAI-UHFFFAOYSA-N
Data  1 IC50
  Tab Delimited (TSV)   2D SDfile   Computed 3D by Vconf -m prep SDfile
Find this compound or compounds like it in BindingDB:
Activity Spreadsheet -- Enzyme Inhibition Constant Data from BindingDB
Found 1 hit for monomerid = 50082156
TargetCapsid scaffolding protein(Human cytomegalovirus (strain AD169) (HHV-5) (Huma...)
Smithkline Beecham Pharmaceuticals
Curated by ChEMBL
LigandPNGBDBM50082156(2-[4-(3-Hydroxyamino-benzoyl)-benzyl]-5-methyl-3H-...)
Affinity DataIC50:  2.00E+3nM. Assay description: Inhibitory activity against Human Cytomegalovirus (hCMV) protease
In DepthDetails ArticlePubMed