BDBM50082617 Benzyl-[2-((1S,2R)-2-ethyl-1,2-dihydro-naphthalen-1-yl)-ethyl]-amine::CHEMBL344813
SMILES CC[C@@H]1C=Cc2ccccc2[C@H]1CCNCc1ccccc1
InChI Key InChIKey=KALAYTDAUFXMQW-NQIIRXRSSA-N
Data  2 KI
  Tab Delimited (TSV)   2D SDfile   Computed 3D by Vconf -m prep SDfile
Find this compound or compounds like it in BindingDB:
Activity Spreadsheet -- Enzyme Inhibition Constant Data from BindingDB
Found 2 hits for monomerid = 50082617
TargetSigma non-opioid intracellular receptor 1(Homo sapiens (Human))
Research Triangle Institute
Curated by ChEMBL
LigandPNGBDBM50082617(Benzyl-[2-((1S,2R)-2-ethyl-1,2-dihydro-naphthalen-...)
Affinity DataKi:  16.6nM. Assay description: Affinity against Sigma opioid receptor type 1 using [3H]-(+)-Pentazocine in guinea pig brain membranes
In DepthDetails ArticlePubMed
TargetSigma non-opioid intracellular receptor 1(Homo sapiens (Human))
Research Triangle Institute
Curated by ChEMBL
LigandPNGBDBM50082617(Benzyl-[2-((1S,2R)-2-ethyl-1,2-dihydro-naphthalen-...)
Affinity DataKi:  759nM. Assay description: Affinity against Sigma opioid receptor type 2 using [3H]- DTG in rat liver membranes
In DepthDetails ArticlePubMed