BDBM50082910 (S)-2-({5-[((S)-1-Cyclohexylmethyl-2-ethanesulfonyl-ethylamino)-methyl]-2'-methyl-biphenyl-2-carbonyl}-amino)-4-methylsulfanyl-butyric acid::CHEMBL358363
SMILES CCS(=O)(=O)C[C@H](CC1CCCCC1)NCc1ccc(C(=O)N[C@@H](CCSC)C(O)=O)c(c1)-c1ccccc1C
InChI Key InChIKey=FJDXENQMICMEKN-SVEHJYQDSA-N
Data  1 IC50
  Tab Delimited (TSV)   2D SDfile   Computed 3D by Vconf -m prep SDfile
Find this compound or compounds like it in BindingDB:
Activity Spreadsheet -- Enzyme Inhibition Constant Data from BindingDB
Found 1 hit for monomerid = 50082910
LigandPNGBDBM50082910((S)-2-({5-[((S)-1-Cyclohexylmethyl-2-ethanesulfony...)
Affinity DataIC50:  0.140nM. Assay description: In vitro inhibitory activity against Farnesyltransferase (FTase)
In DepthDetails ArticlePubMed