BDBM50083094 3-Phenyl-3-{1-[3-(5-[1,2,4]triazol-4-yl-1H-indol-3-yl)-propyl]-piperidin-4-ylamino}-propan-1-ol::CHEMBL146628
SMILES OCCC(NC1CCN(CCCc2c[nH]c3ccc(cc23)-n2cnnc2)CC1)c1ccccc1
InChI Key InChIKey=RIYUAVWOWLOOFN-UHFFFAOYSA-N
Data  2 IC50  1 EC50
  Tab Delimited (TSV)   2D SDfile   Computed 3D by Vconf -m prep SDfile
Find this compound or compounds like it in BindingDB:
Activity Spreadsheet -- Enzyme Inhibition Constant Data from BindingDB
Found 3 hits for monomerid = 50083094
Target5-hydroxytryptamine receptor 1B(Homo sapiens (Human))
Merck Sharp & Dohme Research Laboratories
Curated by ChEMBL
LigandPNGBDBM50083094(3-Phenyl-3-{1-[3-(5-[1,2,4]triazol-4-yl-1H-indol-3...)
Affinity DataIC50:  150nM. Assay description: Binding affinity at cloned human 5-hydroxytryptamine 1B receptor stably expressed in CHO cells by [3H]-5-HT displacement.
In DepthDetails ArticlePubMed
Target5-hydroxytryptamine receptor 1D(Homo sapiens (Human))
Merck Sharp & Dohme Research Laboratories
Curated by ChEMBL
LigandPNGBDBM50083094(3-Phenyl-3-{1-[3-(5-[1,2,4]triazol-4-yl-1H-indol-3...)
Affinity DataEC50:  5.10nM. Assay description: Agonist-induced [35S]- GTPgammaS binding in CHO cells stably transfected with 5-hydroxytryptamine 1D receptor
In DepthDetails ArticlePubMed
Target5-hydroxytryptamine receptor 1D(Homo sapiens (Human))
Merck Sharp & Dohme Research Laboratories
Curated by ChEMBL
LigandPNGBDBM50083094(3-Phenyl-3-{1-[3-(5-[1,2,4]triazol-4-yl-1H-indol-3...)
Affinity DataIC50:  5.5nM. Assay description: Binding affinity at human cloned 5-hydroxytryptamine 1D receptor stably expressed in CHO cells by [3H]-5-HT displacement.
In DepthDetails ArticlePubMed