BDBM50083391 3-Carboxy-1-{[1-(1,2-dicarboxy-ethylcarbamoyl)-2-methyl-butylcarbamoyl]-mercapto-methyl}-propyl-ammonium::CHEMBL344321
SMILES CC[C@@H](C)[C@H](NC(=O)[C@@H](S)[C@H]([NH3+])CCC([O-])=O)C(=O)N[C@@H](CC(O)=O)C(O)=O
InChI Key InChIKey=DVQGHYMQIXFLEX-KOOJSXSQSA-N
Data  2 KI
  Tab Delimited (TSV)   2D SDfile   Computed 3D by Vconf -m prep SDfile
Find this compound or compounds like it in BindingDB:
Activity Spreadsheet -- Enzyme Inhibition Constant Data from BindingDB
Found 2 hits for monomerid = 50083391
TargetGlutamyl aminopeptidase(Homo sapiens (Human))
University Of Paris
Curated by ChEMBL
LigandPNGBDBM50083391(3-Carboxy-1-{[1-(1,2-dicarboxy-ethylcarbamoyl)-2-m...)
Affinity DataKi:  267nM. Assay description: Binding affinity against recombinant Aminopeptidase A
In DepthDetails ArticlePubMed
TargetAminopeptidase N(Sus scrofa (Pig))
University Of Paris
Curated by ChEMBL
LigandPNGBDBM50083391(3-Carboxy-1-{[1-(1,2-dicarboxy-ethylcarbamoyl)-2-m...)
Affinity DataKi: >1.00E+4nM. Assay description: Binding affinity against aminopeptidase N from pig kidney
In DepthDetails ArticlePubMed