BDBM50083492 (S)-3-(6-Methyl-pyridin-3-yl)-3-{[(R)-1-(3-piperidin-4-yl-propionyl)-piperidine-3-carbonyl]-amino}-propionic acid::CHEMBL358779
SMILES Cc1ccc(cn1)[C@H](CC(O)=O)NC(=O)[C@@H]1CCCN(C1)C(=O)CCC1CCNCC1
InChI Key InChIKey=QRGILGTYGXRRFJ-UXHICEINSA-N
Data  1 IC50
  Tab Delimited (TSV)   2D SDfile   Computed 3D by Vconf -m prep SDfile
Find this compound or compounds like it in BindingDB:
Activity Spreadsheet -- Enzyme Inhibition Constant Data from BindingDB
Found 1 hit for monomerid = 50083492
TargetIntegrin alpha-IIb/beta-3(Homo sapiens (Human))
The R. W. Johnson Pharmaceutical Research Institute
Curated by ChEMBL
LigandPNGBDBM50083492((S)-3-(6-Methyl-pyridin-3-yl)-3-{[(R)-1-(3-piperid...)
Affinity DataIC50:  0.130nM. Assay description: In vitro inhibition of biotinylated fibrinogen binding to immobolized fibrinogen receptor.
In DepthDetails ArticlePubMed