BDBM50083552 1,9-di{4-[5-amino(imino)methylbenzo[b]furan-2-ylcarbonyl]hexahydro-1-pyrazinyl}-1,9-nonanedione::CHEMBL113452
SMILES NC(=N)c1ccc2oc(cc2c1)C(=O)N1CCN(CC1)C(=O)CCCCCCCC(=O)N1CCN(CC1)C(=O)c1cc2cc(ccc2o1)C(N)=N
InChI Key InChIKey=YQZZYTVUJVKJSN-UHFFFAOYSA-N
Data  2 KI
  Tab Delimited (TSV)   2D SDfile   Computed 3D by Vconf -m prep SDfile
Find this compound or compounds like it in BindingDB:
Activity Spreadsheet -- Enzyme Inhibition Constant Data from BindingDB
Found 2 hits for monomerid = 50083552
TargetTryptase beta-2/delta/gamma(Homo sapiens (Human))
Yoshitomi Pharmaceutical Industries
Curated by ChEMBL
LigandPNGBDBM50083552(1,9-di{4-[5-amino(imino)methylbenzo[b]furan-2-ylca...)
Affinity DataKi:  0.0190nM. Assay description: Inhibition of tryptase activity
In DepthDetails ArticlePubMed
TargetProthrombin(Homo sapiens (Human))
Yoshitomi Pharmaceutical Industries
Curated by ChEMBL
LigandPNGBDBM50083552(1,9-di{4-[5-amino(imino)methylbenzo[b]furan-2-ylca...)
Affinity DataKi:  2.30E+5nM. Assay description: Inhibition of thrombin
In DepthDetails ArticlePubMed