BDBM50083556 1-{4-[5-amino(imino)methylbenzo[b]furan-2-ylcarbonyl]hexahydro-1-pyrazinyl}-2-[5-(2-{4-[5-amino(imino)methylbenzo[b]furan-2-ylcarbonyl]hexahydro-1-pyrazinyl}-2-oxoethoxy)cyclooctyloxy]-1-ethanone::CHEMBL324622
SMILES NC(=N)c1ccc2oc(cc2c1)C(=O)N1CCN(CC1)C(=O)CO[C@H]1CCC[C@H](CCC1)OCC(=O)N1CCN(CC1)C(=O)c1cc2cc(ccc2o1)C(N)=N
InChI Key InChIKey=RRBKNHHBEVRVIE-RNPORBBMSA-N
Data  2 KI
  Tab Delimited (TSV)   2D SDfile   Computed 3D by Vconf -m prep SDfile
Find this compound or compounds like it in BindingDB:
Activity Spreadsheet -- Enzyme Inhibition Constant Data from BindingDB
Found 2 hits for monomerid = 50083556
TargetTryptase beta-2/delta/gamma(Homo sapiens (Human))
Yoshitomi Pharmaceutical Industries
Curated by ChEMBL
LigandPNGBDBM50083556(1-{4-[5-amino(imino)methylbenzo[b]furan-2-ylcarbon...)
Affinity DataKi:  0.0290nM. Assay description: Inhibition of tryptase activity
In DepthDetails ArticlePubMed
TargetProthrombin(Homo sapiens (Human))
Yoshitomi Pharmaceutical Industries
Curated by ChEMBL
LigandPNGBDBM50083556(1-{4-[5-amino(imino)methylbenzo[b]furan-2-ylcarbon...)
Affinity DataKi:  1.50E+4nM. Assay description: Inhibition of thrombin
In DepthDetails ArticlePubMed