BDBM50083906 4-Ethyl-6-methoxy-9H-beta-carboline-3-carboxylic acid ethyl ester::CHEMBL173329
SMILES CCOC(=O)c1[nH]cc2nc3ccc(OC)cc3c2c1CC
InChI Key InChIKey=STHRYAZDXIDVJO-UHFFFAOYSA-N
Data  5 KI
  Tab Delimited (TSV)   2D SDfile   Computed 3D by Vconf -m prep SDfile
Find this compound or compounds like it in BindingDB:
Activity Spreadsheet -- Enzyme Inhibition Constant Data from BindingDB
Found 5 hits for monomerid = 50083906
TargetGABA-A receptor; alpha-5/beta-3/gamma-2(Homo sapiens (Human))
University Of Wisconsin-Milwaukee
Curated by ChEMBL
LigandPNGBDBM50083906(4-Ethyl-6-methoxy-9H-beta-carboline-3-carboxylic a...)
Affinity DataKi:  1nM. Assay description: Binding affinity for human recombinant gamma-aminobutyric-acid (GABA) A receptor alpha-5-beta-3-gamma-2
In DepthDetails ArticlePubMed
TargetGamma-aminobutyric acid receptor subunit alpha-1/beta-3/gamma-2(Homo sapiens (Human))
University Of Wisconsin-Milwaukee
Curated by ChEMBL
LigandPNGBDBM50083906(4-Ethyl-6-methoxy-9H-beta-carboline-3-carboxylic a...)
Affinity DataKi:  1.60nM. Assay description: Binding affinity for human recombinant gamma-aminobutyric-acid (GABA) A receptor alpha-1-beta-3-gamma-2
Target InfoGoogleScholar
In DepthDetails ArticlePubMed
TargetGamma-aminobutyric acid receptor subunit alpha-3/beta-3/gamma-2(Homo sapiens (Human))
University Of Wisconsin-Milwaukee
Curated by ChEMBL
LigandPNGBDBM50083906(4-Ethyl-6-methoxy-9H-beta-carboline-3-carboxylic a...)
Affinity DataKi:  2.80nM. Assay description: Binding affinity for human recombinant gamma-aminobutyric-acid (GABA) A receptor alpha-3-beta-3-gamma-2
In DepthDetails ArticlePubMed
TargetGABA-A receptor; alpha-2/beta-3/gamma-2(Homo sapiens (Human))
University Of Wisconsin-Milwaukee
Curated by ChEMBL
LigandPNGBDBM50083906(4-Ethyl-6-methoxy-9H-beta-carboline-3-carboxylic a...)
Affinity DataKi:  2.90nM. Assay description: Binding affinity to human recombinant gamma-aminobutyric-acid (GABA) A receptor alpha-2-beta-3-gamma-2
In DepthDetails ArticlePubMed
TargetGamma-aminobutyric acid receptor subunit alpha-6/beta-3/gamma-2(Homo sapiens (Human))
University Of Wisconsin-Milwaukee
Curated by ChEMBL
LigandPNGBDBM50083906(4-Ethyl-6-methoxy-9H-beta-carboline-3-carboxylic a...)
Affinity DataKi: >1.00E+3nM. Assay description: Binding affinity for human recombinant gamma-aminobutyric-acid (GABA) A receptor alpha-6-beta-3-gamma-2
In DepthDetails ArticlePubMed