BDBM50083964 3-[((3E)-3-{[(E)-amino(imino)methyl]hydrazono}propyl)oxy]-5-methylphenyl 2-methoxybenzenesulfonate::CHEMBL129282
SMILES COc1ccccc1S(=O)(=O)Oc1cc(C)cc(OCCC=NNC(N)=N)c1
InChI Key InChIKey=OVTINMISLFADJH-UHFFFAOYSA-N
Data  1 KI
  Tab Delimited (TSV)   2D SDfile   Computed 3D by Vconf -m prep SDfile
Find this compound or compounds like it in BindingDB:
Activity Spreadsheet -- Enzyme Inhibition Constant Data from BindingDB
Found 1 hit for monomerid = 50083964
TargetProthrombin(Homo sapiens (Human))
3-Dimensional Pharmaceuticals
Curated by ChEMBL
LigandPNGBDBM50083964(3-[((3E)-3-{[(E)-amino(imino)methyl]hydrazono}prop...)
Affinity DataKi:  11nM. Assay description: Inhibitory constant against human alpha thrombin
In DepthDetails ArticlePubMed