BDBM50084085 2-Chloro-benzenesulfonic acid 3-(1-carbamimidoyl-piperidin-4-ylmethoxy)-5-methoxy-phenyl ester::CHEMBL166779
SMILES COc1cc(OCC2CCN(CC2)C(N)=N)cc(OS(=O)(=O)c2ccccc2Cl)c1
InChI Key InChIKey=FICHPMBMLYANBU-UHFFFAOYSA-N
Data  1 KI
  Tab Delimited (TSV)   2D SDfile   Computed 3D by Vconf -m prep SDfile
Find this compound or compounds like it in BindingDB:
Activity Spreadsheet -- Enzyme Inhibition Constant Data from BindingDB
Found 1 hit for monomerid = 50084085
TargetProthrombin(Homo sapiens (Human))
3-Dimensional Pharmaceuticals
Curated by ChEMBL
LigandPNGBDBM50084085(2-Chloro-benzenesulfonic acid 3-(1-carbamimidoyl-p...)
Affinity DataKi:  44nM. Assay description: Anti- Thrombin activity using standard chromogenic assay
In DepthDetails ArticlePubMed