BDBM50084186 2,9-di[1-[4-amino(imino)methylphenyl]-(Z)-methylidene]-1-cyclononanone::CHEMBL150739
SMILES NC(=N)c1ccc(\C=C2\CCCCCC\C(=C\c3ccc(cc3)C(N)=N)C2=O)cc1
InChI Key InChIKey=FMUJSNADNLVZIJ-BMJUYKDLSA-N
Data  3 KI
  Tab Delimited (TSV)   2D SDfile   Computed 3D by Vconf -m prep SDfile
Find this compound or compounds like it in BindingDB:
Activity Spreadsheet -- Enzyme Inhibition Constant Data from BindingDB
Found 3 hits for monomerid = 50084186
TargetCoagulation factor X(Homo sapiens (Human))
Berlex Biosciences
Curated by ChEMBL
LigandPNGBDBM50084186(2,9-di[1-[4-amino(imino)methylphenyl]-(Z)-methylid...)
Affinity DataKi:  2.80nM. Assay description: In vitro inhibition of human coagulation factor Xa (Xa) in a purified enzyme system.
In DepthDetails ArticlePubMed
TargetSerine protease 1(Bos taurus (bovine))
Berlex Biosciences
Curated by ChEMBL
LigandPNGBDBM50084186(2,9-di[1-[4-amino(imino)methylphenyl]-(Z)-methylid...)
Affinity DataKi:  190nM. Assay description: In vitro inhibition of bovine trypsin(Trp).
In DepthDetails ArticlePubMed
TargetProthrombin(Homo sapiens (Human))
Berlex Biosciences
Curated by ChEMBL
LigandPNGBDBM50084186(2,9-di[1-[4-amino(imino)methylphenyl]-(Z)-methylid...)
Affinity DataKi:  290nM. Assay description: In vitro inhibition of human thrombin(FIIa).
In DepthDetails ArticlePubMed