BDBM50084853 CHEMBL136548::Cyclohexanecarboxylic acid (2-{4-[(2-methoxy-phenyl)-methyl-amino]-piperidin-1-yl}-ethyl)-pyridin-2-yl-amide
SMILES COc1ccccc1N(C)C1CCN(CCN(C(=O)C2CCCCC2)c2ccccn2)CC1
InChI Key InChIKey=DLHGSZRCHURVAU-UHFFFAOYSA-N
Data  1 IC50
  Tab Delimited (TSV)   2D SDfile   Computed 3D by Vconf -m prep SDfile
Find this compound or compounds like it in BindingDB:
Activity Spreadsheet -- Enzyme Inhibition Constant Data from BindingDB
Found 1 hit for monomerid = 50084853
Target5-hydroxytryptamine receptor 1A(Rattus norvegicus (rat))
University Of Groningen
Curated by ChEMBL
LigandPNGBDBM50084853(CHEMBL136548 | Cyclohexanecarboxylic acid (2-{4-[(...)
Affinity DataIC50:  1.29E+3nM. Assay description: In vitro affinity against 5-hydroxytryptamine 1A receptor using [3H]-8-OH-DPAT in rat hippocampus
In DepthDetails ArticlePubMed