BDBM50084922 CHEMBL3427359
SMILES Oc1ccc(\C=N\N2CCN(CC2)C2CCCC2)c(O)c1
InChI Key InChIKey=KFDDUIMMXYGZBQ-SFQUDFHCSA-N
Data  1 IC50
  Tab Delimited (TSV)   2D SDfile   Computed 3D by Vconf -m prep SDfile
Find this compound or compounds like it in BindingDB:
Activity Spreadsheet -- Enzyme Inhibition Constant Data from BindingDB
Found 1 hit for monomerid = 50084922
TargetPatatin-like phospholipase domain-containing protein 2(Mus musculus)
Graz University Of Technology
Curated by ChEMBL
LigandPNGBDBM50084922(CHEMBL3427359)
Affinity DataIC50: >2.00E+5nM. Assay description: Inhibition of mouse recombinant ATGL expressed in African green monkey COS7 cells assessed as reduction in triglyceride hydrolase activity using radi...
In DepthDetails ArticlePubMed