BDBM50084930 CHEMBL3427366
SMILES Fc1ccc(OC(=O)N2CCN(CC2)c2ccccc2)cc1F
InChI Key InChIKey=KAZVABOQPWEQTM-UHFFFAOYSA-N
Data  1 IC50
  Tab Delimited (TSV)   2D SDfile   Computed 3D by Vconf -m prep SDfile
Find this compound or compounds like it in BindingDB:
Activity Spreadsheet -- Enzyme Inhibition Constant Data from BindingDB
Found 1 hit for monomerid = 50084930
TargetPatatin-like phospholipase domain-containing protein 2(Mus musculus)
Graz University Of Technology
Curated by ChEMBL
LigandPNGBDBM50084930(CHEMBL3427366)
Affinity DataIC50:  1.10E+5nM. Assay description: Inhibition of mouse recombinant ATGL expressed in African green monkey COS7 cells assessed as reduction in triglyceride hydrolase activity using radi...
In DepthDetails ArticlePubMed