BDBM50085498 4-(1-Benzyloxymethyl-pentadecylcarbamoyl)-butyric acid::5-(1-(benzyloxy)hexadecan-2-ylamino)-5-oxopentanoic acid::CHEMBL89863
SMILES CCCCCCCCCCCCCCC(COCc1ccccc1)NC(=O)CCCC(O)=O
InChI Key InChIKey=BACZPDDISHCEER-UHFFFAOYSA-N
Data  1 IC50
  Tab Delimited (TSV)   2D SDfile   Computed 3D by Vconf -m prep SDfile
Find this compound or compounds like it in BindingDB:
Activity Spreadsheet -- Enzyme Inhibition Constant Data from BindingDB
Found 1 hit for monomerid = 50085498
TargetCytosolic phospholipase A2(Mus musculus)
Univ. De Valencia
Curated by ChEMBL
LigandPNGBDBM50085498(4-(1-Benzyloxymethyl-pentadecylcarbamoyl)-butyric ...)
Affinity DataIC50:  1.05E+4nM. Assay description: Effect on cytosolic Phospholipase A2 (PLA2) activity at a concentration of 100 uM
In DepthDetails ArticlePubMed