BDBM50085839 CHEMBL170348::[2-Cyano-5-(pyridin-3-ylmethoxy)-phenoxy]-o-tolyl-acetic acid (0.2H2O)
SMILES Cc1ccccc1C(Oc1cc(OCc2cccnc2)ccc1C#N)C(O)=O
InChI Key InChIKey=UNPSSUUNLAENBV-UHFFFAOYSA-N
Data  1 IC50
  Tab Delimited (TSV)   2D SDfile   Computed 3D by Vconf -m prep SDfile
Find this compound or compounds like it in BindingDB:
Activity Spreadsheet -- Enzyme Inhibition Constant Data from BindingDB
Found 1 hit for monomerid = 50085839
TargetEndothelin-1 receptor(RAT)
RhôNe-Poulenc Rorer
Curated by ChEMBL
LigandPNGBDBM50085839(CHEMBL170348 | [2-Cyano-5-(pyridin-3-ylmethoxy)-ph...)
Affinity DataIC50:  30nM. Assay description: In vitro ability to antagonise the binding of [125I]-ET-1 to the rat aortic A10 cell membrane endothelin A receptor.
In DepthDetails ArticlePubMed