BDBM50085848 CHEMBL172164::[2-Cyano-5-(thiophen-3-ylmethoxy)-phenoxy]-(2-methoxy-phenyl)-acetic acid (0.75H2O)
SMILES COc1ccccc1C(Oc1cc(OCc2ccsc2)ccc1C#N)C(O)=O
InChI Key InChIKey=KLGOTHVVBCZAAC-UHFFFAOYSA-N
Data  1 IC50
  Tab Delimited (TSV)   2D SDfile   Computed 3D by Vconf -m prep SDfile
Find this compound or compounds like it in BindingDB:
Activity Spreadsheet -- Enzyme Inhibition Constant Data from BindingDB
Found 1 hit for monomerid = 50085848
TargetEndothelin-1 receptor(RAT)
RhôNe-Poulenc Rorer
Curated by ChEMBL
LigandPNGBDBM50085848(CHEMBL172164 | [2-Cyano-5-(thiophen-3-ylmethoxy)-p...)
Affinity DataIC50:  529nM. Assay description: In vitro ability to antagonise the binding of [125I]-ET-1 to the rat aortic A10 cell membrane endothelin A receptor.
In DepthDetails ArticlePubMed