BDBM50085851 CHEMBL171760::[2-Cyano-5-(3,4,5-trimethoxy-benzyloxy)-phenoxy]-o-tolyl-acetic acid
SMILES COc1cc(COc2ccc(C#N)c(OC(C(O)=O)c3ccccc3C)c2)cc(OC)c1OC
InChI Key InChIKey=ISFQGZBEYXXUNF-UHFFFAOYSA-N
Data  1 IC50
  Tab Delimited (TSV)   2D SDfile   Computed 3D by Vconf -m prep SDfile
Find this compound or compounds like it in BindingDB:
Activity Spreadsheet -- Enzyme Inhibition Constant Data from BindingDB
Found 1 hit for monomerid = 50085851
TargetEndothelin-1 receptor(RAT)
RhôNe-Poulenc Rorer
Curated by ChEMBL
LigandPNGBDBM50085851(CHEMBL171760 | [2-Cyano-5-(3,4,5-trimethoxy-benzyl...)
Affinity DataIC50: >3.00E+3nM. Assay description: In vitro ability to antagonise the binding of [125I]-ET-1 to the rat aortic A10 cell membrane endothelin A receptor.
In DepthDetails ArticlePubMed