BDBM50085855 CHEMBL170202::[5-(Benzo[1,3]dioxol-5-ylmethoxy)-2-cyano-phenoxy]-(2-trifluoromethyl-phenyl)-acetic acid
SMILES OC(=O)C(Oc1cc(OCc2ccc3OCOc3c2)ccc1C#N)c1ccccc1C(F)(F)F
InChI Key InChIKey=HRPHGGDUHPKFGM-UHFFFAOYSA-N
Data  1 IC50
  Tab Delimited (TSV)   2D SDfile   Computed 3D by Vconf -m prep SDfile
Find this compound or compounds like it in BindingDB:
Activity Spreadsheet -- Enzyme Inhibition Constant Data from BindingDB
Found 1 hit for monomerid = 50085855
TargetEndothelin-1 receptor(RAT)
RhôNe-Poulenc Rorer
Curated by ChEMBL
LigandPNGBDBM50085855(CHEMBL170202 | [5-(Benzo[1,3]dioxol-5-ylmethoxy)-2...)
Affinity DataIC50:  16nM. Assay description: In vitro ability to antagonise the binding of [125I]-ET-1 to the rat aortic A10 cell membrane endothelin A receptor.
In DepthDetails ArticlePubMed