BDBM50086410 CHEMBL3426080
SMILES FC(F)(F)c1cccc(Nc2ncnc3ccc(cc23)-c2cncs2)c1
InChI Key InChIKey=GDJPSUNLWNVYIH-UHFFFAOYSA-N
Data  2 IC50
  Tab Delimited (TSV)   2D SDfile   Computed 3D by Vconf -m prep SDfile
Find this compound or compounds like it in BindingDB:
Activity Spreadsheet -- Enzyme Inhibition Constant Data from BindingDB
Found 2 hits for monomerid = 50086410
TargetADP-ribosyl cyclase/cyclic ADP-ribose hydrolase 1(Homo sapiens (Human))
Glaxosmithkline
Curated by ChEMBL
LigandPNGBDBM50086410(CHEMBL3426080)
Affinity DataIC50:  2.15E+3nM. Assay description: Inhibition of human CD38 extracellular domain expressed in Pichia pastoris assessed as NAD hydrolysis by colorimetric-based assay
In DepthDetails ArticlePubMed
TargetADP-ribosyl cyclase/cyclic ADP-ribose hydrolase 1(Mus musculus)
Glaxosmithkline
Curated by ChEMBL
LigandPNGBDBM50086410(CHEMBL3426080)
Affinity DataIC50:  42nM. Assay description: Inhibition of mouse recombinant CD38 extracellular domain expressed in CHO CGE cells assessed as NAD hydrolysis by fluorescence plate reader analysis
In DepthDetails ArticlePubMed