BDBM50086679 8-{3-[4-(4-Fluoro-phenyl)-piperazin-1-yl]-2-hydroxy-propoxy}-4H-benzo[1,4]thiazin-3-one::CHEMBL142995
SMILES OC(COc1cccc2NC(=O)CSc12)CN1CCN(CC1)c1ccc(F)cc1
InChI Key InChIKey=PGAIECSQNAEQMI-UHFFFAOYSA-N
Data  4 KI
  Tab Delimited (TSV)   2D SDfile   Computed 3D by Vconf -m prep SDfile
Find this compound or compounds like it in BindingDB:
Activity Spreadsheet -- Enzyme Inhibition Constant Data from BindingDB
Found 4 hits for monomerid = 50086679
TargetAlpha-1A/Alpha-1B/Alpha-1D adrenergic receptor(Rattus norvegicus (rat))
Università
Curated by ChEMBL
LigandPNGBDBM50086679(8-{3-[4-(4-Fluoro-phenyl)-piperazin-1-yl]-2-hydrox...)
Affinity DataKi:  60nM. Assay description: Alpha-1 adrenergic receptor binding affinity by measuring the displacement of [3H]prazosin binding in rat brain
In DepthDetails ArticlePubMed
TargetBeta-2 adrenergic receptor(Canis familiaris)
Università
Curated by ChEMBL
LigandPNGBDBM50086679(8-{3-[4-(4-Fluoro-phenyl)-piperazin-1-yl]-2-hydrox...)
Affinity DataKi: >1.00E+3nM. Assay description: Beta-2 adrenergic receptor binding affinity by measuring the displacement of [3H]-DHA binding in rat lung; Not Active means Ki >1000 nM
In DepthDetails ArticlePubMed
LigandPNGBDBM50086679(8-{3-[4-(4-Fluoro-phenyl)-piperazin-1-yl]-2-hydrox...)
Affinity DataKi:  1.50E+3nM. Assay description: Alpha-2 adrenergic receptor binding affinity by measuring the displacement of [3H]clonidine binding in rat cerebral cortex
In DepthDetails ArticlePubMed
TargetBeta-1 adrenergic receptor(Rattus norvegicus (Rat))
Università
Curated by ChEMBL
LigandPNGBDBM50086679(8-{3-[4-(4-Fluoro-phenyl)-piperazin-1-yl]-2-hydrox...)
Affinity DataKi:  6.70E+3nM. Assay description: Compound was evaluated for its Beta-1 adrenergic receptor binding affinity by measuring the displacement of [3H]-dihydroalprenolol binding in rat hea...
In DepthDetails ArticlePubMed