BDBM50086698 CHEMBL3426319
SMILES OC(=O)c1c(CCCOc2cccc3ccccc23)c2cccc3CCCn1c23
InChI Key InChIKey=XOMAOOTVWOCYAD-UHFFFAOYSA-N
Data  3 KI
PDB links: 1 PDB ID matches this monomer.
  Tab Delimited (TSV)   2D SDfile   Computed 3D by Vconf -m prep SDfile
Find this compound or compounds like it in BindingDB:
Activity Spreadsheet -- Enzyme Inhibition Constant Data from BindingDB
Found 3 hits for monomerid = 50086698
TargetInduced myeloid leukemia cell differentiation protein Mcl-1(Homo sapiens (Human))
Vanderbilt University School Of Medicine
Curated by ChEMBL
LigandPNGBDBM50086698(CHEMBL3426319)
Affinity DataKi:  310nM. Assay description: Displacement of FITC-Bak-BH3 peptide from Mcl-1 (unknown origin) incubated for 1.5 hrs by FPA competition assay
TargetApoptosis regulator Bcl-2(Homo sapiens (Human))
Vanderbilt University School Of Medicine
Curated by ChEMBL
LigandPNGBDBM50086698(CHEMBL3426319)
Affinity DataKi:  7.30E+3nM. Assay description: Displacement of FITC-Bak-BH3 peptide from Bcl-2 (unknown origin) incubated for 1.5 hrs by FPA competition assay
In DepthDetails ArticlePubMed
TargetBcl-2-like protein 1(Homo sapiens (Human))
Vanderbilt University School Of Medicine
Curated by ChEMBL
LigandPNGBDBM50086698(CHEMBL3426319)
Affinity DataKi: >2.00E+4nM. Assay description: Displacement of FITC-Bak-BH3 peptide from Bcl-xL (unknown origin) incubated for 1.5 hrs by FPA competition assay
In DepthDetails ArticlePubMed