BDBM50086717 JNJ-39439335::Mavatrep
SMILES CC(C)(O)c1ccccc1-c1ccc2[nH]c(\C=C\c3ccc(cc3)C(F)(F)F)nc2c1
InChI Key InChIKey=ORDHXXHTBUZRCN-NTEUORMPSA-N
Data  1 KI  7 IC50
  Tab Delimited (TSV)   2D SDfile   Computed 3D by Vconf -m prep SDfile
Find this compound or compounds like it in BindingDB:
Activity Spreadsheet -- Enzyme Inhibition Constant Data from BindingDB
Found 8 hits for monomerid = 50086717
LigandPNGBDBM50086717(JNJ-39439335 | Mavatrep)
Affinity DataKi:  6.5nM. Assay description: Displacement of [3H]-RTX from human TRPV1 transfected in HEK293 cells after 60 mins by scintillation spectroscopic analysis
In DepthDetails ArticlePubMed
LigandPNGBDBM50086717(JNJ-39439335 | Mavatrep)
Affinity DataIC50:  21nM. Assay description: Antagonist activity at recombinant rat TRPV1 expressed in HEK293 cells assessed as inhibition of capsaicin-induced Ca2+ influx preincubated for 5 min...
In DepthDetails ArticlePubMed
LigandPNGBDBM50086717(JNJ-39439335 | Mavatrep)
Affinity DataIC50:  6.80nMpH: 5.0Assay Description:Antagonist activity at recombinant human TRPV1 expressed in HEK293 cells assessed as inhibition of pH 5-induced current measured for 150 secs by patc...
In DepthDetails ArticlePubMed
TargetCytochrome P450 1A2(Homo sapiens (Human))
TBA
Curated by ChEMBL
LigandPNGBDBM50086717(JNJ-39439335 | Mavatrep)
Affinity DataIC50: >2.50E+4nM. Assay description: Inhibition of CYP1A2 in human liver microsomes
In DepthDetails ArticlePubMed
TargetCytochrome P450 2D6(Homo sapiens (Human))
TBA
Curated by ChEMBL
LigandPNGBDBM50086717(JNJ-39439335 | Mavatrep)
Affinity DataIC50: >2.50E+4nM. Assay description: Inhibition of CYP2D6 in human liver microsomes
In DepthDetails ArticlePubMed
LigandPNGBDBM50086717(JNJ-39439335 | Mavatrep)
Affinity DataIC50:  23nM. Assay description: Antagonist activity at recombinant human TRPV1 expressed in HEK293 cells assessed as inhibition of capsaicin-induced current measured for 150 secs by...
In DepthDetails ArticlePubMed
LigandPNGBDBM50086717(JNJ-39439335 | Mavatrep)
Affinity DataIC50:  4.60nM. Assay description: Antagonist activity at recombinant human TRPV1 expressed in HEK293 cells assessed as inhibition of capsaicin-induced Ca2+ influx preincubated for 5 m...
In DepthDetails ArticlePubMed
TargetCytochrome P450 3A4(Homo sapiens (Human))
TBA
Curated by ChEMBL
LigandPNGBDBM50086717(JNJ-39439335 | Mavatrep)
Affinity DataIC50: >2.50E+4nM. Assay description: Inhibition of CYP3A4 in human liver microsomes
In DepthDetails ArticlePubMed