BDBM50087247 5-{4-[(7-Chloro-2-oxo-2H-chromen-4-ylmethyl)-amino]-benzenesulfonylamino}-[1,3,4]thiadiazole-2-sulfonic acid amide::CHEMBL158693
SMILES Cn1nc(s\c1=N/S(=O)(=O)c1ccc(NCc2cc(=O)oc3cc(Cl)ccc23)cc1)S(N)(=O)=O
InChI Key InChIKey=HRVAZKKEGJGZOW-MOHJPFBDSA-N
Data  3 KI
  Tab Delimited (TSV)   2D SDfile   Computed 3D by Vconf -m prep SDfile
Find this compound or compounds like it in BindingDB:
Activity Spreadsheet -- Enzyme Inhibition Constant Data from BindingDB
Found 3 hits for monomerid = 50087247
TargetCarbonic anhydrase 2(Homo sapiens (Human))
Universit£
Curated by ChEMBL
LigandPNGBDBM50087247(5-{4-[(7-Chloro-2-oxo-2H-chromen-4-ylmethyl)-amino...)
Affinity DataKi:  0.5nM. Assay description: Inhibition of human cloned Carbonic anhydrase II
In DepthDetails ArticlePubMed
TargetCarbonic anhydrase 4(Bos taurus (bovine))
Universit£
Curated by ChEMBL
LigandPNGBDBM50087247(5-{4-[(7-Chloro-2-oxo-2H-chromen-4-ylmethyl)-amino...)
Affinity DataKi:  0.600nM. Assay description: Inhibition of bovine Carbonic anhydrase IV determined by esterase method
In DepthDetails ArticlePubMed
TargetCarbonic anhydrase 1(Homo sapiens (Human))
Universit£
Curated by ChEMBL
LigandPNGBDBM50087247(5-{4-[(7-Chloro-2-oxo-2H-chromen-4-ylmethyl)-amino...)
Affinity DataKi:  1nM. Assay description: Inhibition of human cloned Carbonic anhydrase I
In DepthDetails ArticlePubMed