BDBM50088185 CHEMBL3427435
SMILES OC(=O)CC[C@H](NP(O)(=O)OCCC[C@H](NC(=O)CC[C@H](NC(=O)CCCCCNC(=O)c1ccc(F)cc1)C(O)=O)C(O)=O)C(O)=O
InChI Key InChIKey=IZLOSIXADNUSCM-ACRUOGEOSA-N
Data  1 IC50
PDB links: 1 PDB ID matches this monomer.
  Tab Delimited (TSV)   2D SDfile   Computed 3D by Vconf -m prep SDfile
Find this compound or compounds like it in BindingDB:
Activity Spreadsheet -- Enzyme Inhibition Constant Data from BindingDB
Found 1 hit for monomerid = 50088185
TargetGlutamate carboxypeptidase 2(Homo sapiens (Human))
Washington State University
Curated by ChEMBL
LigandPNGBDBM50088185(CHEMBL3427435)
Affinity DataIC50:  400nM. Assay description: Inhibition of PSMA (unknown origin) incubated for 15 mins using PABGgG substrate by HPLC method