BDBM50088245 4-[6-Amino-2-(4-formyl-phenylethynyl)-purin-9-yl]-2,3-dimethoxy-cyclopentanecarboxylic acid ethylamide
SMILES CCNC(=O)[C@H]1CC([C@H](OC)[C@@H]1OC)n1cnc2c(N)nc(nc12)C#Cc1ccc(C=O)cc1
InChI Key InChIKey=GDKDCKYAZLXMCX-MSLCQOBGSA-N
Data  1 KI
  Tab Delimited (TSV)   2D SDfile   Computed 3D by Vconf -m prep SDfile
Find this compound or compounds like it in BindingDB:
Activity Spreadsheet -- Enzyme Inhibition Constant Data from BindingDB
Found 1 hit for monomerid = 50088245
TargetAdenosine receptor A2a(Rattus norvegicus (rat))
Neogenesis
Curated by ChEMBL
LigandPNGBDBM50088245(4-[6-Amino-2-(4-formyl-phenylethynyl)-purin-9-yl]-...)
Affinity DataKi:  6.30nM. Assay description: Binding affinity to Adenosine A2A receptor
In DepthDetails ArticlePubMed