BDBM50088428 (1R,2R,3S,4R,5S)-4-[2-Chloro-6-(3-iodo-benzylamino)-purin-9-yl]-1-hydroxymethyl-bicyclo[3.1.0]hexane-2,3-diol::4-[2-Chloro-6-(3-iodo-benzylamino)-purin-9-yl]-1-hydroxymethyl-bicyclo[3.1.0]hexane-2,3-diol::4-[2-chloro-6-(3-iodobenzylamino)-9H-9-purinyl]-1-hydroxymethyl-(1R,2R,3S,4R,5S)-bicyclo[3.1.0]hexane-2,3-diol::CHEMBL27809
SMILES OC[C@@]12C[C@@H]1[C@H]([C@H](O)[C@@H]2O)n1cnc2c(NCc3cccc(I)c3)nc(Cl)nc12
InChI Key InChIKey=ISZYFLVJJCPYGN-NFPQMFLLSA-N
Data  10 KI  3 EC50
  Tab Delimited (TSV)   2D SDfile   Computed 3D by Vconf -m prep SDfile
Find this compound or compounds like it in BindingDB:
Activity Spreadsheet -- Enzyme Inhibition Constant Data from BindingDB
Found 13 hits for monomerid = 50088428
TargetAdenosine receptor A3(Homo sapiens (Human))
National Institute Of Diabetes And Digestive And Kidney Diseases
Curated by ChEMBL
LigandPNGBDBM50088428((1R,2R,3S,4R,5S)-4-[2-Chloro-6-(3-iodo-benzylamino...)
Affinity DataKi:  1.90nM. Assay description: Inhibition of [125I]-AB-MECA binding to human Adenosine A3 receptor expressed in CHO cells
In DepthDetails ArticlePubMed
TargetAdenosine receptor A3(Homo sapiens (Human))
National Institute Of Diabetes And Digestive And Kidney Diseases
Curated by ChEMBL
LigandPNGBDBM50088428((1R,2R,3S,4R,5S)-4-[2-Chloro-6-(3-iodo-benzylamino...)
Affinity DataKi:  2.20nM. Assay description: Displacement of [125I]- AB-MECA from human adenosine A3 receptor expressed in HEK cells
In DepthDetails ArticlePubMed
TargetAdenosine receptor A3(Homo sapiens (Human))
National Institute Of Diabetes And Digestive And Kidney Diseases
Curated by ChEMBL
LigandPNGBDBM50088428((1R,2R,3S,4R,5S)-4-[2-Chloro-6-(3-iodo-benzylamino...)
Affinity DataKi:  2.20nM. Assay description: Displacement of [125I]AB-MECA from human Adenosine A3 receptor expressed in CHO cells expressed as Ki
In DepthDetails ArticlePubMed
TargetAdenosine receptor A1(Homo sapiens (Human))
National Institute Of Diabetes And Digestive And Kidney Diseases
Curated by ChEMBL
LigandPNGBDBM50088428((1R,2R,3S,4R,5S)-4-[2-Chloro-6-(3-iodo-benzylamino...)
Affinity DataKi:  65nM. Assay description: Inhibition of [3H]-R-PIA binding to human Adenosine A1 receptor expressed in CHO cells
In DepthDetails ArticlePubMed
TargetAdenosine receptor A1(Rattus norvegicus (rat))
National Institute Of Diabetes
Curated by ChEMBL
LigandPNGBDBM50088428((1R,2R,3S,4R,5S)-4-[2-Chloro-6-(3-iodo-benzylamino...)
Affinity DataKi:  141nM. Assay description: Displacement of [3H]R-PIA from rat brain membrane Adenosine A1 receptor
In DepthDetails ArticlePubMed
TargetAdenosine receptor A1(Rattus norvegicus (rat))
National Institute Of Diabetes
Curated by ChEMBL
LigandPNGBDBM50088428((1R,2R,3S,4R,5S)-4-[2-Chloro-6-(3-iodo-benzylamino...)
Affinity DataKi:  141nM. Assay description: Ability to displace specific radioligand [3H]R-PIA binding at Adenosine A1 receptor in rat brain membrane
In DepthDetails ArticlePubMed
TargetAdenosine receptor A2a(Rattus norvegicus (rat))
Niddk
Curated by ChEMBL
LigandPNGBDBM50088428((1R,2R,3S,4R,5S)-4-[2-Chloro-6-(3-iodo-benzylamino...)
Affinity DataKi:  732nM. Assay description: Ability to displace specific radioligand [3H]-CGS- 21680 binding at A2A receptors (rA2A) in rat brain membrane
In DepthDetails ArticlePubMed
TargetAdenosine receptor A2a(Rattus norvegicus (rat))
Niddk
Curated by ChEMBL
LigandPNGBDBM50088428((1R,2R,3S,4R,5S)-4-[2-Chloro-6-(3-iodo-benzylamino...)
Affinity DataKi:  732nM. Assay description: Displacement of specific [3H]-CGS- 21680 binding to adenosine A2A receptor in rat striatal membranes
In DepthDetails ArticlePubMed
TargetAdenosine receptor A2a(Homo sapiens (Human))
National Institute Of Diabetes And Digestive And Kidney Diseases
Curated by ChEMBL
LigandPNGBDBM50088428((1R,2R,3S,4R,5S)-4-[2-Chloro-6-(3-iodo-benzylamino...)
Affinity DataKi:  1.60E+3nM. Assay description: Inhibition of [3H]-CGS- 21680 binding to human Adenosine A2A receptor expressed in CHO cells
In DepthDetails ArticlePubMed
TargetAdenosine receptor A2b(Homo sapiens (Human))
National Institute Of Diabetes
Curated by ChEMBL
LigandPNGBDBM50088428((1R,2R,3S,4R,5S)-4-[2-Chloro-6-(3-iodo-benzylamino...)
Affinity DataKi:  4.10E+4nM. Assay description: Displacement of [3H]- ZM-241385 from human adenosine A2B receptor expressed in HEK cells
In DepthDetails ArticlePubMed
TargetAdenosine receptor A1(Homo sapiens (Human))
National Institute Of Diabetes And Digestive And Kidney Diseases
Curated by ChEMBL
LigandPNGBDBM50088428((1R,2R,3S,4R,5S)-4-[2-Chloro-6-(3-iodo-benzylamino...)
Affinity DataEC50:  142nM. Assay description: Stimulation of [35S]GTP-gamma-S, binding to human adenosine A1 receptor
In DepthDetails ArticlePubMed
TargetAdenosine receptor A1(Rattus norvegicus (rat))
National Institute Of Diabetes
Curated by ChEMBL
LigandPNGBDBM50088428((1R,2R,3S,4R,5S)-4-[2-Chloro-6-(3-iodo-benzylamino...)
Affinity DataEC50:  684nM. Assay description: Stimulation of [35S]GTP-gamma-S, binding to adenosine A1 receptor of rat cerebral cortical membrane
In DepthDetails ArticlePubMed
TargetAdenosine receptor A3(Homo sapiens (Human))
National Institute Of Diabetes And Digestive And Kidney Diseases
Curated by ChEMBL
LigandPNGBDBM50088428((1R,2R,3S,4R,5S)-4-[2-Chloro-6-(3-iodo-benzylamino...)
Affinity DataEC50:  0.670nM. Assay description: Stimulation of [35S]GTP-gamma-S, against human adenosine A3 receptor
In DepthDetails ArticlePubMed