BDBM50088469 1-(2-(diethylamino)quinazolin-4-yl)-3-phenylurea::1-(2-Diethylamino-quinazolin-4-yl)-3-phenyl-urea::CHEMBL305516
SMILES CCN(CC)c1nc(NC(=O)Nc2ccccc2)c2ccccc2n1
InChI Key InChIKey=OACDZTWEJRHLMO-UHFFFAOYSA-N
Data  3 KI
  Tab Delimited (TSV)   2D SDfile   Computed 3D by Vconf -m prep SDfile
Find this compound or compounds like it in BindingDB:
Activity Spreadsheet -- Enzyme Inhibition Constant Data from BindingDB
Found 3 hits for monomerid = 50088469
TargetAdenosine receptor A3(Homo sapiens (Human))
Università
Curated by ChEMBL
LigandPNGBDBM50088469(1-(2-(diethylamino)quinazolin-4-yl)-3-phenylurea |...)
Affinity DataKi:  180nM. Assay description: Displacement of [3H]MRE 3008F20 from human adenosine A3 receptor expressed in CHO cells
In DepthDetails ArticlePubMed
TargetAdenosine receptor A1(Rattus norvegicus (rat))
Vrije Universiteit
Curated by ChEMBL
LigandPNGBDBM50088469(1-(2-(diethylamino)quinazolin-4-yl)-3-phenylurea |...)
Affinity DataKi:  6.48E+4nM. Assay description: Displacement of [3H]-DPCPX from adenosine A1 receptor of rat brain cortical membrane
In DepthDetails ArticlePubMed
TargetAdenosine receptor A3(Homo sapiens (Human))
Università
Curated by ChEMBL
LigandPNGBDBM50088469(1-(2-(diethylamino)quinazolin-4-yl)-3-phenylurea |...)
Affinity DataKi:  1.78E+5nM. Assay description: Binding affinity of the compound was determined by its ability to displace [125I]-AB-MECA from human adenosine A3 receptor expressed in HEK 293 cells
In DepthDetails ArticlePubMed