BDBM50088702 CHEMBL275469::N-{2-[4-(2-Isopropoxy-phenyl)-piperazin-1-yl]-ethyl}-2-(2-oxo-piperidin-1-yl)-acetamide::RWJ-38063
SMILES CC(C)Oc1ccccc1N1CCN(CCNC(=O)CN2CCCCC2=O)CC1
InChI Key InChIKey=IIRJWNCOXHFIBK-UHFFFAOYSA-N
Data  4 KI
  Tab Delimited (TSV)   2D SDfile   Computed 3D by Vconf -m prep SDfile
Find this compound or compounds like it in BindingDB:
Activity Spreadsheet -- Enzyme Inhibition Constant Data from BindingDB
Found 4 hits for monomerid = 50088702
TargetAlpha-1A adrenergic receptor(Homo sapiens (Human))
The R. W. Johnson Pharmaceutical Research Institute
Curated by ChEMBL
LigandPNGBDBM50088702(CHEMBL275469 | N-{2-[4-(2-Isopropoxy-phenyl)-piper...)
Affinity DataKi:  8.70nM. Assay description: Binding affinity for human Alpha-1A adrenergic receptor expressed in COS cell membranes
In DepthDetails ArticlePubMed
TargetAlpha-1A adrenergic receptor(Homo sapiens (Human))
The R. W. Johnson Pharmaceutical Research Institute
Curated by ChEMBL
LigandPNGBDBM50088702(CHEMBL275469 | N-{2-[4-(2-Isopropoxy-phenyl)-piper...)
Affinity DataKi:  9.30nM. Assay description: Binding constant measured against Alpha-1A adrenergic receptor in human prostate; ++:moderately active
In DepthDetails ArticlePubMed
TargetAlpha-1D adrenergic receptor(Homo sapiens (Human))
The R. W. Johnson Pharmaceutical Research Institute
Curated by ChEMBL
LigandPNGBDBM50088702(CHEMBL275469 | N-{2-[4-(2-Isopropoxy-phenyl)-piper...)
Affinity DataKi:  372nM. Assay description: Binding affinity for human Alpha-1D adrenergic receptor expressed in COS cell membranes
In DepthDetails ArticlePubMed
TargetAlpha-1B adrenergic receptor(Homo sapiens (Human))
The R. W. Johnson Pharmaceutical Research Institute
Curated by ChEMBL
LigandPNGBDBM50088702(CHEMBL275469 | N-{2-[4-(2-Isopropoxy-phenyl)-piper...)
Affinity DataKi:  4.61E+4nM. Assay description: Binding affinity for human Alpha-1B adrenergic receptor expressed in COS cell membranes
In DepthDetails ArticlePubMed