BDBM50088800 2-Cyclohexanecarbonyl-cyclohexane-1,3-dione::CHEMBL168189::CHEMBL72311
SMILES O=C(C1CCCCC1)C1C(=O)CCCC1=O
InChI Key InChIKey=VFBHSHFLKVLYLV-UHFFFAOYSA-N
Data  4 IC50
  Tab Delimited (TSV)   2D SDfile   Computed 3D by Vconf -m prep SDfile
Find this compound or compounds like it in BindingDB:
Activity Spreadsheet -- Enzyme Inhibition Constant Data from BindingDB
Found 4 hits for monomerid = 50088800
Target4-hydroxyphenylpyruvate dioxygenase(Sus scrofa)
Zhejiang University
Curated by ChEMBL
LigandPNGBDBM50088800(2-Cyclohexanecarbonyl-cyclohexane-1,3-dione | CHEM...)
Affinity DataIC50:  3.63E+5nM. Assay description: Concentration required to achieve 50% inhibition against 4-Hydroxyphenylpyruvate dioxygenase (HPPD) from pig liver
In DepthDetails ArticlePubMed
Target4-hydroxyphenylpyruvate dioxygenase(Sus scrofa)
Zhejiang University
Curated by ChEMBL
LigandPNGBDBM50088800(2-Cyclohexanecarbonyl-cyclohexane-1,3-dione | CHEM...)
Affinity DataIC50:  3.65E+5nM. Assay description: Inhibition of pig HPPD
In DepthDetails ArticlePubMed
Target4-hydroxyphenylpyruvate dioxygenase(Sus scrofa)
Zhejiang University
Curated by ChEMBL
LigandPNGBDBM50088800(2-Cyclohexanecarbonyl-cyclohexane-1,3-dione | CHEM...)
Affinity DataIC50:  3.65E+5nM. Assay description: Inhibition of 4-hydroxyphenylpyruvate dioxygenase of purified pig liver by enol-borate method
In DepthDetails ArticlePubMed
Target4-hydroxyphenylpyruvate dioxygenase(Sus scrofa)
Zhejiang University
Curated by ChEMBL
LigandPNGBDBM50088800(2-Cyclohexanecarbonyl-cyclohexane-1,3-dione | CHEM...)
Affinity DataIC50:  3.65E+5nM. Assay description: Concentration required to achieve 50% inhibition against 4-hydroxyphenylpyruvate dioxygenase from pig liver
In DepthDetails ArticlePubMed