BDBM50088941 7-{2-tert-Butyl-5-[1-(1-imino-ethyl)-piperidin-4-yloxy]-benzoimidazol-1-ylmethyl}-naphthalene-2-carboxamidine::CHEMBL175286
SMILES CC(=N)N1CCC(CC1)Oc1ccc2n(Cc3ccc4ccc(cc4c3)C(N)=N)c(nc2c1)C(C)(C)C
InChI Key InChIKey=DYQGLHRGCMDZOQ-UHFFFAOYSA-N
Data  3 KI
  Tab Delimited (TSV)   2D SDfile   Computed 3D by Vconf -m prep SDfile
Find this compound or compounds like it in BindingDB:
Activity Spreadsheet -- Enzyme Inhibition Constant Data from BindingDB
Found 3 hits for monomerid = 50088941
TargetCoagulation factor X(Homo sapiens (Human))
Berlex Biosciences
Curated by ChEMBL
LigandPNGBDBM50088941(7-{2-tert-Butyl-5-[1-(1-imino-ethyl)-piperidin-4-y...)
Affinity DataKi:  2nM. Assay description: In vitro inhibitory activity against human Coagulation factor X
In DepthDetails ArticlePubMed
TargetSerine protease 1(Bos taurus (bovine))
Berlex Biosciences
Curated by ChEMBL
LigandPNGBDBM50088941(7-{2-tert-Butyl-5-[1-(1-imino-ethyl)-piperidin-4-y...)
Affinity DataKi:  18nM. Assay description: In vitro inhibitory activity against bovine cationic trypsin
In DepthDetails ArticlePubMed
TargetProthrombin(Homo sapiens (Human))
Berlex Biosciences
Curated by ChEMBL
LigandPNGBDBM50088941(7-{2-tert-Butyl-5-[1-(1-imino-ethyl)-piperidin-4-y...)
Affinity DataKi:  950nM. Assay description: In vitro inhibitory activity against human coagulation factor II
In DepthDetails ArticlePubMed