BDBM50088947 7-{5-[1-(1-Imino-ethyl)-piperidin-4-yloxy]-2-isopropyl-benzoimidazol-1-ylmethyl}-naphthalene-2-carboxamidine::CHEMBL176744
SMILES CC(C)c1nc2cc(OC3CCN(CC3)C(C)=N)ccc2n1Cc1ccc2ccc(cc2c1)C(N)=N
InChI Key InChIKey=KGPZQXDFVFKKHK-UHFFFAOYSA-N
Data  3 KI
  Tab Delimited (TSV)   2D SDfile   Computed 3D by Vconf -m prep SDfile
Find this compound or compounds like it in BindingDB:
Activity Spreadsheet -- Enzyme Inhibition Constant Data from BindingDB
Found 3 hits for monomerid = 50088947
TargetCoagulation factor X(Homo sapiens (Human))
Berlex Biosciences
Curated by ChEMBL
LigandPNGBDBM50088947(7-{5-[1-(1-Imino-ethyl)-piperidin-4-yloxy]-2-isopr...)
Affinity DataKi:  2nM. Assay description: In vitro inhibitory activity against human Coagulation factor X
In DepthDetails ArticlePubMed
TargetSerine protease 1(Bos taurus (bovine))
Berlex Biosciences
Curated by ChEMBL
LigandPNGBDBM50088947(7-{5-[1-(1-Imino-ethyl)-piperidin-4-yloxy]-2-isopr...)
Affinity DataKi:  16nM. Assay description: In vitro inhibitory activity against bovine cationic trypsin
In DepthDetails ArticlePubMed
TargetProthrombin(Homo sapiens (Human))
Berlex Biosciences
Curated by ChEMBL
LigandPNGBDBM50088947(7-{5-[1-(1-Imino-ethyl)-piperidin-4-yloxy]-2-isopr...)
Affinity DataKi:  870nM. Assay description: In vitro inhibitory activity against human coagulation factor II
In DepthDetails ArticlePubMed