BDBM50088953 3-{1-(7-Carbamimidoyl-naphthalen-2-ylmethyl)-6-[1-(1-imino-ethyl)-piperidin-4-yloxy]-1H-benzoimidazol-2-yl}-propionamide::CHEMBL367725
SMILES CC(=N)N1CCC(CC1)Oc1ccc2nc(CCC(N)=O)n(Cc3ccc4ccc(cc4c3)C(N)=N)c2c1
InChI Key InChIKey=CHVNHRFASUIVAZ-UHFFFAOYSA-N
Data  3 KI
  Tab Delimited (TSV)   2D SDfile   Computed 3D by Vconf -m prep SDfile
Find this compound or compounds like it in BindingDB:
Activity Spreadsheet -- Enzyme Inhibition Constant Data from BindingDB
Found 3 hits for monomerid = 50088953
TargetCoagulation factor X(Homo sapiens (Human))
Berlex Biosciences
Curated by ChEMBL
LigandPNGBDBM50088953(3-{1-(7-Carbamimidoyl-naphthalen-2-ylmethyl)-6-[1-...)
Affinity DataKi:  1nM. Assay description: In vitro inhibitory activity against human Coagulation factor X
In DepthDetails ArticlePubMed
TargetSerine protease 1(Bos taurus (bovine))
Berlex Biosciences
Curated by ChEMBL
LigandPNGBDBM50088953(3-{1-(7-Carbamimidoyl-naphthalen-2-ylmethyl)-6-[1-...)
Affinity DataKi:  4.40nM. Assay description: In vitro inhibitory activity against bovine cationic trypsin
In DepthDetails ArticlePubMed
TargetProthrombin(Homo sapiens (Human))
Berlex Biosciences
Curated by ChEMBL
LigandPNGBDBM50088953(3-{1-(7-Carbamimidoyl-naphthalen-2-ylmethyl)-6-[1-...)
Affinity DataKi:  590nM. Assay description: In vitro inhibitory activity against human coagulation factor II
In DepthDetails ArticlePubMed