BDBM50089233 CHEMBL3577868
SMILES CC(C)NC(=O)N[C@H]1CC[C@@H](CC1)Nc1ncc2ccc(=O)n(C(C)C)c2n1
InChI Key InChIKey=FJVVBMGXZMJPOI-WKILWMFISA-N
Data  4 IC50
PDB links: 1 PDB ID matches this monomer.
  Tab Delimited (TSV)   2D SDfile   Computed 3D by Vconf -m prep SDfile
Find this compound or compounds like it in BindingDB:
Activity Spreadsheet -- Enzyme Inhibition Constant Data from BindingDB
Found 4 hits for monomerid = 50089233
TargetMitogen-activated protein kinase 8(Homo sapiens (Human))
Translational Research Institute
Curated by ChEMBL
LigandPNGBDBM50089233(CHEMBL3577868)
Affinity DataIC50:  21nM. Assay description: Inhibition of JNK1 (unknown origin) using biotinylated FL-ATF-2 as substrate after 1 hr by homogeneous time-resolved fluorescence assay
TargetMitogen-activated protein kinase 10(Homo sapiens (Human))
Translational Research Institute
Curated by ChEMBL
LigandPNGBDBM50089233(CHEMBL3577868)
Affinity DataIC50:  15nM. Assay description: Inhibition of JNK3alpha-1 (unknown origin) using biotinylated FL-ATF-2 as substrate after 1 hr by homogeneous time-resolved fluorescence assay
TargetMitogen-activated protein kinase 9(Homo sapiens (Human))
Translational Research Institute
Curated by ChEMBL
LigandPNGBDBM50089233(CHEMBL3577868)
Affinity DataIC50:  66nM. Assay description: Inhibition of JNK2 (unknown origin) using biotinylated FL-ATF-2 as substrate after 1 hr by homogeneous time-resolved fluorescence assay
TargetMitogen-activated protein kinase 11/12/13/14(Homo sapiens (Human))
Translational Research Institute
Curated by ChEMBL
LigandPNGBDBM50089233(CHEMBL3577868)
Affinity DataIC50: >5.00E+3nM. Assay description: Inhibition of p38 (unknown origin) using biotinylated FL-ATF-2 as substrate after 1 hr by homogeneous time-resolved fluorescence assay
In DepthDetails ArticlePubMed