BDBM50089451 CHEMBL3578202
SMILES OC(=O)CC[C@H](NC(=O)N[C@@H](CCCCNC(=O)CCCCCNC(=O)CCc1ccc(O)c(CN(CCN(CC(O)=O)Cc2cc(CCC(O)=O)ccc2O)CC(O)=O)c1)C(O)=O)C(O)=O
InChI Key InChIKey=QJUIUFGOTBRHKP-LQJZCPKCSA-N
Data  1 KI
  Tab Delimited (TSV)   2D SDfile   Computed 3D by Vconf -m prep SDfile
Find this compound or compounds like it in BindingDB:
Activity Spreadsheet -- Enzyme Inhibition Constant Data from BindingDB
Found 1 hit for monomerid = 50089451
TargetGlutamate carboxypeptidase 2(Homo sapiens (Human))
Academy Of Sciences Of The Czech Republic
Curated by ChEMBL
LigandPNGBDBM50089451(CHEMBL3578202)
Affinity DataKi:  0.0180nM. Assay description: Inhibition of antiTEV-tagged GCP2 extracellular portion (aa 44-750) (unknown origin) using folyl-di-L-glutamate as substrate by HPLC-based enzymatic ...
In DepthDetails ArticlePubMed