BDBM50090024 (S)-4-(3,4-Difluoro-phenyl)-1-methyl-2-oxo-1,2,3,4-tetrahydro-pyrimidine-5-carboxylic acid {3-[4-cyano-4-(4-fluoro-phenyl)-piperidin-1-yl]-propyl}-amide::CHEMBL419497
SMILES CN1C=C([C@@H](NC1=O)c1ccc(F)c(F)c1)C(=O)NCCCN1CCC(CC1)(C#N)c1ccc(F)cc1
InChI Key InChIKey=LDXAPIWITLZXNM-DEOSSOPVSA-N
Data  3 KI
  Tab Delimited (TSV)   2D SDfile   Computed 3D by Vconf -m prep SDfile
Find this compound or compounds like it in BindingDB:
Activity Spreadsheet -- Enzyme Inhibition Constant Data from BindingDB
Found 3 hits for monomerid = 50090024
TargetAlpha-1A adrenergic receptor(Homo sapiens (Human))
Merck Research Laboratories
Curated by ChEMBL
LigandPNGBDBM50090024((S)-4-(3,4-Difluoro-phenyl)-1-methyl-2-oxo-1,2,3,4...)
Affinity DataKi:  2.30nM. Assay description: Ability to displace [125I]- HEAT from human cloned Alpha-1A adrenergic receptor stably expressed in CHO cells.
In DepthDetails ArticlePubMed
TargetAlpha-1B adrenergic receptor(Homo sapiens (Human))
Merck Research Laboratories
Curated by ChEMBL
LigandPNGBDBM50090024((S)-4-(3,4-Difluoro-phenyl)-1-methyl-2-oxo-1,2,3,4...)
Affinity DataKi:  320nM. Assay description: Ability to displace [125I]- HEAT from human cloned Alpha-1B adrenergic receptor stably expressed in LM cells.
In DepthDetails ArticlePubMed
TargetAlpha-1D adrenergic receptor(Homo sapiens (Human))
Merck Research Laboratories
Curated by ChEMBL
LigandPNGBDBM50090024((S)-4-(3,4-Difluoro-phenyl)-1-methyl-2-oxo-1,2,3,4...)
Affinity DataKi:  710nM. Assay description: Ability to displace [125I]- HEAT from human cloned Alpha-1D adrenergic receptor stably expressed in HEK cells.
In DepthDetails ArticlePubMed