BDBM50090211 2-(3-Methyl-piperazin-1-yl)-6-nitro-quinoline::CHEMBL43526
SMILES CC1CN(CCN1)c1ccc2cc(ccc2n1)[N+]([O-])=O
InChI Key InChIKey=WIRIBEHWECMIRC-UHFFFAOYSA-N
Data  2 KI
  Tab Delimited (TSV)   2D SDfile   Computed 3D by Vconf -m prep SDfile
Find this compound or compounds like it in BindingDB:
Activity Spreadsheet -- Enzyme Inhibition Constant Data from BindingDB
Found 2 hits for monomerid = 50090211
TargetSodium-dependent serotonin transporter(Rattus norvegicus (rat))
Central Washington University
Curated by ChEMBL
LigandPNGBDBM50090211(2-(3-Methyl-piperazin-1-yl)-6-nitro-quinoline | CH...)
Affinity DataKi:  4.60nM. Assay description: In vitro radioligand [3H]-paroxetine from rat cortical Serotonin transporter
In DepthDetails ArticlePubMed
TargetSodium-dependent serotonin transporter(Rattus norvegicus (rat))
Central Washington University
Curated by ChEMBL
LigandPNGBDBM50090211(2-(3-Methyl-piperazin-1-yl)-6-nitro-quinoline | CH...)
Affinity DataKi:  22nM. Assay description: Inhibition of [3H]citalopram binding to Serotonin transporter of rat cerebral cortex
In DepthDetails ArticlePubMed