BDBM50090364 3-[2-Hydroxycarbamoyl-1-(4-methoxy-benzenesulfonyl)-ethyl]-cyclohexanecarboxylic acid ethyl ester::CHEMBL40746
SMILES CCOC(=O)C1CCCC(C1)C(CC(=O)NO)S(=O)(=O)c1ccc(OC)cc1
InChI Key InChIKey=MACBSAQGLFHSQT-UHFFFAOYSA-N
Data  3 KI
  Tab Delimited (TSV)   2D SDfile   Computed 3D by Vconf -m prep SDfile
Find this compound or compounds like it in BindingDB:
Activity Spreadsheet -- Enzyme Inhibition Constant Data from BindingDB
Found 3 hits for monomerid = 50090364
Target72 kDa type IV collagenase(Homo sapiens (Human))
Rhone-Poulenc Rorer
Curated by ChEMBL
LigandPNGBDBM50090364(3-[2-Hydroxycarbamoyl-1-(4-methoxy-benzenesulfonyl...)
Affinity DataKi:  0.800nM. Assay description: In vitro inhibition of human recombinant Matrix metalloproteinase-2.
In DepthDetails ArticlePubMed
TargetStromelysin-1(Homo sapiens (Human))
Rhone-Poulenc Rorer
Curated by ChEMBL
LigandPNGBDBM50090364(3-[2-Hydroxycarbamoyl-1-(4-methoxy-benzenesulfonyl...)
Affinity DataKi:  60nM. Assay description: In vitro inhibition of human recombinant Matrix metalloproteinase-3.
In DepthDetails ArticlePubMed
TargetInterstitial collagenase(Homo sapiens (Human))
Rhone-Poulenc Rorer
Curated by ChEMBL
LigandPNGBDBM50090364(3-[2-Hydroxycarbamoyl-1-(4-methoxy-benzenesulfonyl...)
Affinity DataKi:  1.01E+3nM. Assay description: In vitro inhibition of human recombinant Matrix metalloproteinase-1.
In DepthDetails ArticlePubMed