BDBM50090885 2-[4-(4-Fluoro-phenylamino)-5-iodo-pyrrolo[2,3-d]pyrimidin-7-yl]-5-methyl-tetrahydro-furan-3,4-diol::CHEMBL431628
SMILES C[C@H]1O[C@H]([C@H](O)[C@@H]1O)n1cc(I)c2c(Nc3ccc(F)cc3)ncnc12
InChI Key InChIKey=ARJFWOWPNOLBMA-ADOTYWSXSA-N
Data  1 IC50
  Tab Delimited (TSV)   2D SDfile   Computed 3D by Vconf -m prep SDfile
Find this compound or compounds like it in BindingDB:
Activity Spreadsheet -- Enzyme Inhibition Constant Data from BindingDB
Found 1 hit for monomerid = 50090885
TargetAdenosine kinase(Homo sapiens (Human))
Metabasis Therapeutics
Curated by ChEMBL
LigandPNGBDBM50090885(2-[4-(4-Fluoro-phenylamino)-5-iodo-pyrrolo[2,3-d]p...)
Affinity DataIC50:  550nM. Assay description: Inhibition of recombinant human adenosine kinase
In DepthDetails ArticlePubMed