BDBM50090886 2-[5-Iodo-4-(4-methoxy-phenylamino)-pyrrolo[2,3-d]pyrimidin-7-yl]-5-methyl-tetrahydro-furan-3,4-diol::CHEMBL98887
SMILES COc1ccc(Nc2ncnc3n(cc(I)c23)[C@@H]2O[C@H](C)[C@@H](O)[C@H]2O)cc1
InChI Key InChIKey=BIGRANHUKHSGPF-POFSUORWSA-N
Data  1 IC50
  Tab Delimited (TSV)   2D SDfile   Computed 3D by Vconf -m prep SDfile
Find this compound or compounds like it in BindingDB:
Activity Spreadsheet -- Enzyme Inhibition Constant Data from BindingDB
Found 1 hit for monomerid = 50090886
TargetAdenosine kinase(Homo sapiens (Human))
Metabasis Therapeutics
Curated by ChEMBL
LigandPNGBDBM50090886(2-[5-Iodo-4-(4-methoxy-phenylamino)-pyrrolo[2,3-d]...)
Affinity DataIC50:  775nM. Assay description: Inhibition of recombinant human adenosine kinase
In DepthDetails ArticlePubMed