BDBM50090894 2-Hydroxymethyl-5-(5-iodo-4-phenylamino-pyrrolo[2,3-d]pyrimidin-7-yl)-tetrahydro-furan-3,4-diol::CHEMBL317176
SMILES OC[C@H]1O[C@H]([C@H](O)[C@@H]1O)n1cc(I)c2c(Nc3ccccc3)ncnc12
InChI Key InChIKey=DSQICYOZULDGHA-LSCFUAHRSA-N
Data  1 IC50
  Tab Delimited (TSV)   2D SDfile   Computed 3D by Vconf -m prep SDfile
Find this compound or compounds like it in BindingDB:
Activity Spreadsheet -- Enzyme Inhibition Constant Data from BindingDB
Found 1 hit for monomerid = 50090894
TargetAdenosine kinase(Homo sapiens (Human))
Metabasis Therapeutics
Curated by ChEMBL
LigandPNGBDBM50090894(2-Hydroxymethyl-5-(5-iodo-4-phenylamino-pyrrolo[2,...)
Affinity DataIC50:  120nM. Assay description: Inhibition of recombinant human adenosine kinase
In DepthDetails ArticlePubMed