BDBM50091117 2-Phenyl-2H-pyrazolo[3,4-c]quinolin-4-ylamine::2-phenyl-2H-pyrazolo[3,4-c]quinolin-4-amine::CHEMBL320805
SMILES Nc1nc2ccccc2c2cn(nc12)-c1ccccc1
InChI Key InChIKey=MVHJGGYPZDDBQV-UHFFFAOYSA-N
Data  8 KI
  Tab Delimited (TSV)   2D SDfile   Computed 3D by Vconf -m prep SDfile
Find this compound or compounds like it in BindingDB:
Activity Spreadsheet -- Enzyme Inhibition Constant Data from BindingDB
Found 8 hits for monomerid = 50091117
TargetAdenosine receptor A1(BOVINE)
Universita' Di Firenze
Curated by ChEMBL
LigandPNGBDBM50091117(2-Phenyl-2H-pyrazolo[3,4-c]quinolin-4-ylamine | 2-...)
Affinity DataKi:  69.2nM. Assay description: Displacement of specific [3H]-CHA binding at adenosine A1 receptor in bovine brain membranes
In DepthDetails ArticlePubMed
TargetAdenosine receptor A2a(Homo sapiens (Human))
Università
Curated by ChEMBL
LigandPNGBDBM50091117(2-Phenyl-2H-pyrazolo[3,4-c]quinolin-4-ylamine | 2-...)
Affinity DataKi:  91nM. Assay description: Displacement of [3H]NECA from human adenosine A2A receptor expressed in CHO cells
In DepthDetails ArticlePubMed
TargetAdenosine receptor A2a(Homo sapiens (Human))
Università
Curated by ChEMBL
LigandPNGBDBM50091117(2-Phenyl-2H-pyrazolo[3,4-c]quinolin-4-ylamine | 2-...)
Affinity DataKi:  91nM. Assay description: Displacement of [3H]ZM241385 from human recombinant adenosine A2A receptor expressed in CHO cell membranes by scintillation counting
In DepthDetails ArticlePubMed
TargetAdenosine receptor A2a(Homo sapiens (Human))
Università
Curated by ChEMBL
LigandPNGBDBM50091117(2-Phenyl-2H-pyrazolo[3,4-c]quinolin-4-ylamine | 2-...)
Affinity DataKi:  331nM. Assay description: Displacement of specific [3H]-CGS- 21680 binding at Adenosine A2A receptor in bovine striatal membranes.
In DepthDetails ArticlePubMed
TargetAdenosine receptor A3(Homo sapiens (Human))
Universita' Di Firenze
Curated by ChEMBL
LigandPNGBDBM50091117(2-Phenyl-2H-pyrazolo[3,4-c]quinolin-4-ylamine | 2-...)
Affinity DataKi:  551nM. Assay description: Displacement of [125I]I-AB-MECA from human recombinant adenosine A3 receptor expressed in CHO cells by scintillation counting
In DepthDetails ArticlePubMed
TargetAdenosine receptor A3(Homo sapiens (Human))
Universita' Di Firenze
Curated by ChEMBL
LigandPNGBDBM50091117(2-Phenyl-2H-pyrazolo[3,4-c]quinolin-4-ylamine | 2-...)
Affinity DataKi:  551nM. Assay description: Displacement of specific [125I]-AB-MECA binding at human adenosine A3 receptor expressed in CHO cells
In DepthDetails ArticlePubMed
TargetAdenosine receptor A1(Homo sapiens (Human))
Universita' Di Firenze
Curated by ChEMBL
LigandPNGBDBM50091117(2-Phenyl-2H-pyrazolo[3,4-c]quinolin-4-ylamine | 2-...)
Affinity DataKi:  659nM. Assay description: Displacement of [3H]DPCPX from human recombinant adenosine A1 receptor expressed in CHO cell membranes by scintillation counting
In DepthDetails ArticlePubMed
TargetAdenosine receptor A1(Homo sapiens (Human))
Universita' Di Firenze
Curated by ChEMBL
LigandPNGBDBM50091117(2-Phenyl-2H-pyrazolo[3,4-c]quinolin-4-ylamine | 2-...)
Affinity DataKi:  659nM. Assay description: Displacement of [3H]DPCPX from human adenosine A1 receptor expressed in CHO cells
In DepthDetails ArticlePubMed