BDBM50091144 2-p-Tolyl-2H-pyrazolo[3,4-c]quinolin-4-ylamine::2-p-tolyl-2H-pyrazolo[3,4-c]quinolin-4-amine::CHEMBL106346
SMILES Cc1ccc(cc1)-n1cc2c(n1)c(N)nc1ccccc21
InChI Key InChIKey=XVEJYBYRDZTECS-UHFFFAOYSA-N
Data  4 KI
  Tab Delimited (TSV)   2D SDfile   Computed 3D by Vconf -m prep SDfile
Find this compound or compounds like it in BindingDB:
Activity Spreadsheet -- Enzyme Inhibition Constant Data from BindingDB
Found 4 hits for monomerid = 50091144
TargetAdenosine receptor A1(Homo sapiens (Human))
Università
Curated by ChEMBL
LigandPNGBDBM50091144(2-p-Tolyl-2H-pyrazolo[3,4-c]quinolin-4-ylamine | 2...)
Affinity DataKi:  45nM. Assay description: Displacement of [3H]DPCPX from human adenosine A1 receptor expressed in CHO cells
In DepthDetails ArticlePubMed
TargetAdenosine receptor A3(Homo sapiens (Human))
Universita' Di Firenze
Curated by ChEMBL
LigandPNGBDBM50091144(2-p-Tolyl-2H-pyrazolo[3,4-c]quinolin-4-ylamine | 2...)
Affinity DataKi:  188nM. Assay description: Displacement of specific [125I]-AB-MECA binding at human adenosine A3 receptor expressed in CHO cells
In DepthDetails ArticlePubMed
TargetAdenosine receptor A1(BOVINE)
Universita' Di Firenze
Curated by ChEMBL
LigandPNGBDBM50091144(2-p-Tolyl-2H-pyrazolo[3,4-c]quinolin-4-ylamine | 2...)
Affinity DataKi:  215nM. Assay description: Displacement of specific [3H]-CHA binding at adenosine A1 receptor in bovine brain membranes
In DepthDetails ArticlePubMed
TargetAdenosine receptor A2a(Homo sapiens (Human))
Università
Curated by ChEMBL
LigandPNGBDBM50091144(2-p-Tolyl-2H-pyrazolo[3,4-c]quinolin-4-ylamine | 2...)
Affinity DataKi:  329nM. Assay description: Displacement of [3H]NECA from human adenosine A2A receptor expressed in CHO cells
In DepthDetails ArticlePubMed