BDBM50091254 CHEMBL109630::Nonanoic acid (S)-2-hydroxy-1-(4-nonylidene-5-oxo-tetrahydro-furan-2-yl)-ethyl ester::Nonanoic acid 2-hydroxy-1-(4-nonylidene-5-oxo-tetrahydro-furan-2-yl)-ethyl ester
SMILES CCCCCCCC\C=C1\CC(OC1=O)[C@H](CO)OC(=O)CCCCCCCC
InChI Key InChIKey=WAXUSWRZNQYUAJ-UJBXMFPWSA-N
Data  2 KI
  Tab Delimited (TSV)   2D SDfile   Computed 3D by Vconf -m prep SDfile
Find this compound or compounds like it in BindingDB:
Activity Spreadsheet -- Enzyme Inhibition Constant Data from BindingDB
Found 2 hits for monomerid = 50091254
TargetProtein kinase C alpha type(Homo sapiens (Human))
National Cancer Institute-Bethesda
Curated by ChEMBL
LigandPNGBDBM50091254(CHEMBL109630 | Nonanoic acid (S)-2-hydroxy-1-(4-no...)
Affinity DataKi:  1.80nM. Assay description: Affinity for protein kinase C alpha
In DepthDetails ArticlePubMed
TargetProtein kinase C alpha type(Homo sapiens (Human))
National Cancer Institute-Bethesda
Curated by ChEMBL
LigandPNGBDBM50091254(CHEMBL109630 | Nonanoic acid (S)-2-hydroxy-1-(4-no...)
Affinity DataKi:  1.76E+3nM. Assay description: Affinity for protein kinase-C alpha (PK-C alpha)
In DepthDetails ArticlePubMed