BDBM50091572 3-[2-(2-Benzyloxycarbonylamino-3-methyl-butyrylamino)-propionylamino]-4-oxo-5-(3-phenyl-propionyloxy)-pentanoic acid::CHEMBL116124
SMILES CC(C)[C@H](NC(=O)OCc1ccccc1)C(=O)N[C@@H](C)C(=O)NC(CC(O)=O)C(=O)COC(=O)CCc1ccccc1
InChI Key InChIKey=VMLHVWHTPKPEDC-SBJNEVENSA-N
Data  1 IC50  1 Kon
  Tab Delimited (TSV)   2D SDfile   Computed 3D by Vconf -m prep SDfile
Find this compound or compounds like it in BindingDB:
Activity Spreadsheet -- Enzyme Inhibition Constant Data from BindingDB
Found 2 hits for monomerid = 50091572
TargetCaspase-1(Homo sapiens (Human))
Basf Bioresearch
Curated by ChEMBL
LigandPNGBDBM50091572(3-[2-(2-Benzyloxycarbonylamino-3-methyl-butyrylami...)
Affinity DataKoff:  1.60E+6s-1Assay Description:Evaluated for dissociation constant for the inhibition of caspase.
In DepthDetails ArticlePubMed
TargetCaspase-1(Homo sapiens (Human))
Basf Bioresearch
Curated by ChEMBL
LigandPNGBDBM50091572(3-[2-(2-Benzyloxycarbonylamino-3-methyl-butyrylami...)
Affinity DataIC50:  1.90nM. Assay description: Compound was evaluated for the inhibitory activity against caspase-1
In DepthDetails ArticlePubMed