BDBM50091687 CHEMBL263350::N-alpha-Ac-[Tic27]PYY(22-36)-NH2(N-alpha-Ac-ASLAHTicLNLVTRQRY-NH2)
SMILES CC(C)C[C@H](NC(=O)[C@H](CO)NC(=O)[C@H](C)NC(C)=O)C(=O)N[C@@H](CCCNC(N)=N)C(=O)N[C@@H](Cc1cnc[nH]1)C(=O)N1Cc2ccccc2CC1C(=O)N[C@@H](CC(C)C)C(=O)N[C@@H](CC(N)=O)C(=O)N[C@@H](CC(C)C)C(=O)N[C@@H](C(C)C)C(=O)N[C@@H]([C@@H](C)O)C(=O)N[C@@H](CCCNC(N)=N)C(=O)N[C@@H](CCC(N)=O)C(=O)N[C@@H](CCCNC(N)=N)C(=O)N[C@@H](Cc1ccc(O)cc1)C(N)=O
InChI Key InChIKey=UFSMQYWCIRNYRR-RDTSJQGISA-N
Data  2 IC50
  Tab Delimited (TSV)   2D SDfile   Computed 3D by Vconf -m prep SDfile
Find this compound or compounds like it in BindingDB:
Activity Spreadsheet -- Enzyme Inhibition Constant Data from BindingDB
Found 2 hits for monomerid = 50091687
TargetNeuropeptide Y receptor type 2(Homo sapiens (Human))
University Of Cincinnati Medical Center
Curated by ChEMBL
LigandPNGBDBM50091687(CHEMBL263350 | N-alpha-Ac-[Tic27]PYY(22-36)-NH2(N-...)
Affinity DataIC50:  186nM. Assay description: Affinity against Neuropeptide Y receptor Y2 in SK-N-BE2 cell line
In DepthDetails ArticlePubMed
TargetNeuropeptide Y receptor type 2(RAT)
University Of Cincinnati Medical Center
Curated by ChEMBL
LigandPNGBDBM50091687(CHEMBL263350 | N-alpha-Ac-[Tic27]PYY(22-36)-NH2(N-...)
Affinity DataIC50:  3.40nM. Assay description: Antisecretory potency, affinity for intestinal PYY of rat jejunum by using short circuit current (SCC) method.
In DepthDetails ArticlePubMed