BDBM50092014 Butyric acid (1aS,1bS,4aS,7aS,8R,9S,9aR)-9-butyryloxy-4a,7b-dihydroxy-3-((R)-hydroxymethyl)-1,1,6,8-tetramethyl-5-oxo-1,1a,1b,4,4a,5,7a,7b,8,9-decahydro-cyclopropa[3,4]benzo[1,2-e]azulen-9a-yl ester::PDBu
SMILES CCCC(=O)O[C@@H]1[C@@H](C)[C@]2(O)[C@@H]3C=C(C)C(=O)[C@]3(O)CC(CO)=C[C@H]2[C@@H]2C(C)(C)[C@]12OC(=O)CCC
InChI Key InChIKey=BQJRUJTZSGYBEZ-KTKRFUPESA-N
Data  5 Kd
  Tab Delimited (TSV)   2D SDfile   Computed 3D by Vconf -m prep SDfile
Find this compound or compounds like it in BindingDB:
Activity Spreadsheet -- Enzyme Inhibition Constant Data from BindingDB
Found 5 hits for monomerid = 50092014
TargetProtein kinase C(Mus musculus)
National Cancer Institute-Bethesda
LigandPNGBDBM50092014(Butyric acid (1aS,1bS,4aS,7aS,8R,9S,9aR)-9-butyryl...)
Affinity DataKd:  0.300nM
In DepthDetails ArticlePubMed
TargetProtein kinase C alpha type(Homo sapiens (Human))
National Cancer Institute-Bethesda
LigandPNGBDBM50092014(Butyric acid (1aS,1bS,4aS,7aS,8R,9S,9aR)-9-butyryl...)
Affinity DataKd:  0.280nM
In DepthDetails ArticlePubMed
TargetProtein kinase C epsilon type(Homo sapiens (Human))
National Cancer Institute-Bethesda
LigandPNGBDBM50092014(Butyric acid (1aS,1bS,4aS,7aS,8R,9S,9aR)-9-butyryl...)
Affinity DataKd:  0.220nM
In DepthDetails ArticlePubMed
TargetProtein kinase C delta type(Homo sapiens (Human))
National Cancer Institute-Bethesda
LigandPNGBDBM50092014(Butyric acid (1aS,1bS,4aS,7aS,8R,9S,9aR)-9-butyryl...)
Affinity DataKd:  0.330nM
In DepthDetails ArticlePubMed
TargetProtein kinase C beta type(Homo sapiens (Human))
National Cancer Institute-Bethesda
LigandPNGBDBM50092014(Butyric acid (1aS,1bS,4aS,7aS,8R,9S,9aR)-9-butyryl...)
Affinity DataKd:  0.200nM
In DepthDetails ArticlePubMed